Project

General

Profile

Issues

Filters

Apply Clear

# Project Tracker Status Priority Subject Author Assignee Target version
7397 Fortress Task Closed Normal NodeVariable.new<type-of-variable>(final String name) Sergey Smolov Andrei Tatarnikov Fortress - 0.4 Actions
7383 Fortress Task Closed Normal boolean isOperation(final Node expr, final T... opId) Sergey Smolov Andrei Tatarnikov Fortress - 0.4 Actions
7271 Retrascope Task Closed Normal add javadoc for new methods when efsm.state.abstraction branch will be merged into master Sergey Smolov Sergey Smolov Retrascope - 0.2 Actions
7166 Retrascope Bug Closed Normal cfg-rnd-testgen: OutOfMemoryError at b10 (1.000.000 ticks) Sergey Smolov Sergey Smolov Retrascope - 0.2 Actions
7145 Retrascope Bug Closed Normal cfg-rnd-testgen: take variable invariants into account Sergey Smolov Sergey Smolov Retrascope - 0.2 Actions
7098 Verilog Translator Bug Closed Normal src/test/verilog/mips16/data_mem.v: 'mem_access_addr' has null declaration Sergey Smolov Sergey Smolov Verilog Translator - 0.1 Actions
7097 Retrascope Bug Closed Normal 32-bit constants should be casted to appropriate values Sergey Smolov Sergey Smolov Retrascope - 0.2 Actions
7096 Retrascope Task Closed Normal assign process merging backend Sergey Smolov Sergey Smolov Retrascope - 0.2 Actions
7081 Retrascope Task Rejected Normal xor-composition-printer Sergey Smolov Sergey Smolov Retrascope - 0.2 Actions
6990 Retrascope IDE Task Rejected Normal use veditor 1.2.1c Sergey Smolov Sergey Smolov Retrascope IDE - 0.1 Actions
6989 Retrascope IDE Task Rejected Normal migrate to Eclipse Mars (4.5) Sergey Smolov Sergey Smolov Retrascope IDE - 0.1 Actions
6988 Retrascope IDE Task New Normal [efsm][visualizator][zest] "organic" layout for EFSM models Sergey Smolov Maxim Chudnov Retrascope IDE - 0.1 Actions
6984 Retrascope IDE Bug Closed Normal java.io.IOException: Unable to resolve plug-in "platform:/plugin/retrascope-ide/icons/retrascope.gif". Sergey Smolov Sergey Smolov Retrascope IDE - 0.1 Actions
6983 Retrascope IDE Task Closed Normal [cfg][visualizator][zest] visualize CfgAssertStatement & CfgLoopStatement nodes Sergey Smolov Sergey Smolov Retrascope IDE - 0.1 Actions
6976 Retrascope Task Closed Normal Wiki update Sergey Smolov Sergey Smolov Retrascope - 0.2 Actions
6956 Retrascope Task Closed Normal HDL Retrascope 0.2.1 release Sergey Smolov Sergey Smolov Retrascope - 0.2 Actions
6892 Retrascope Bug Closed Normal support for non-zero starting bitvectors Sergey Smolov Sergey Smolov Retrascope - 0.2 Actions
6864 Retrascope Task Closed Normal Remove crypto-cores from test suite Sergey Smolov Igor Melnichenko Retrascope - 0.1 Actions
6831 Fortress Task Closed Normal ESExprParser: improve error messages Sergey Smolov Artem Kotsynyak Fortress - 0.4 Actions
6758 Retrascope Task Closed Normal return state/transition coverage for the specified EFSM & test entities Sergey Smolov Sergey Smolov Retrascope - 0.2 Actions
6730 Retrascope Bug Closed Normal fix javadoc Sergey Smolov Mikhail Lebedev Retrascope - 0.1 Actions
6537 Retrascope Developer Request Closed Normal Efsm: collection of resetting guarded actions Sergey Smolov Igor Melnichenko Retrascope - 0.1 Actions
6534 Retrascope Task Closed Normal pass reset-like signals to EFSM-based assertions Sergey Smolov Sergey Smolov Retrascope - 0.1 Actions
6528 Retrascope Task Closed Normal random test generator Sergey Smolov Sergey Smolov Retrascope - 0.1 Actions
6511 Retrascope Task Rejected Normal keep expressions at case statements Sergey Smolov Sergey Smolov Retrascope - 0.1 Actions
6510 Retrascope Bug Closed Normal fix javadoc Sergey Smolov Mikhail Lebedev Retrascope - 0.1 Actions
6509 Retrascope Task Rejected Normal merge embedded switch nodes with conditions depending exactly from the same variable(s) Sergey Smolov Sergey Smolov Retrascope - 0.1 Actions
6507 Castle Task Closed Normal build.gradle: get ANTLR jar from server Sergey Smolov Sergey Smolov Actions
6504 Retrascope Bug Closed Normal fifo/fifo.v: nuSMV model checker returns ERROR Sergey Smolov Mikhail Lebedev Retrascope - 0.1 Actions
6472 Retrascope Task Closed Normal b13.vhd: too long elaboration time Sergey Smolov Mikhail Lebedev Retrascope - 1.0 Actions
6454 Retrascope Task Closed Normal group sequential switches with boolean conditions of "x == a" form Sergey Smolov Sergey Smolov Retrascope - 0.1 Actions
6453 Retrascope Task Closed Normal Statement class for grouping CFG nodes Sergey Smolov Sergey Smolov Retrascope - 0.1 Actions
6447 Retrascope Task Closed Normal SMV-based counterexamples parser Sergey Smolov Mikhail Lebedev Retrascope - 0.2 Actions
6446 Retrascope Task New Normal Promela translator to CFG representation (no buffers) Sergey Smolov Mikhail Lebedev Retrascope - 2.0 Actions
6445 Retrascope Task Closed Normal compare nuXmv and NuSMV Sergey Smolov Mikhail Lebedev Retrascope - 0.1 Actions
6443 Retrascope Bug Closed Normal print error message when "--toplevel" value is wrong Sergey Smolov Sergey Smolov Retrascope - 0.1 Actions
6431 Retrascope Task Closed Normal descriptor for (VHDL) variables & signals Sergey Smolov Sergey Smolov Retrascope - 0.1 Actions
6430 Retrascope Bug Closed Normal b14.vhd: StackOverflowError Sergey Smolov Sergey Smolov Retrascope - 0.2 Actions
6426 Retrascope Bug Closed Normal example.vhd: HlddXmvVisitor.onProcessEnd(HlddXmvVisitor.java:381) -> NullPointerException Sergey Smolov Mikhail Lebedev Retrascope - 0.1 Actions
6425 Retrascope Bug Closed Normal b12.vhd: XmvExprPrinter.getConstant(XmvExprPrinter.java:330) -> NullPointerException Sergey Smolov Mikhail Lebedev Retrascope - 0.1 Actions
6424 Retrascope Bug Closed Normal b05.vhd: line 64: at token "d32_-10": syntax error Sergey Smolov Mikhail Lebedev Retrascope - 0.1 Actions
6413 Retrascope Bug Closed Normal b03.vhd: different EFSM extraction stats Sergey Smolov Sergey Smolov Retrascope - 0.1 Actions
6412 Retrascope Task Rejected Normal engine combining HLDD & assertion model Sergey Smolov Sergey Smolov Retrascope - 0.1 Actions
6410 Retrascope Task Closed Normal no-loop/no-recursion functions elaboration Sergey Smolov Sergey Smolov Retrascope - 0.1 Actions
6394 Local Support Project Bug New Normal Проект HDL Retrascope: на 17-дюймовом мониторе не масштабируется таблица Задачи Sergey Smolov Alexey Demakov Actions
6393 Retrascope Task Rejected Normal migrate to EFSM model containing only concurrent assignments Sergey Smolov Igor Melnichenko Retrascope - 0.2 Actions
6389 Retrascope Task Closed Normal Wiki documentation about testbench simulation Sergey Smolov Sergey Smolov Retrascope - 0.1 Actions
6375 Retrascope Bug Closed Normal missing javadoc Sergey Smolov Igor Melnichenko Retrascope - 0.1 Actions
6366 Retrascope Bug Rejected Normal src/test/vhdl/example/test.vhd: Efsm.UNINITIALISED_STATE isn't supported yet Sergey Smolov Igor Melnichenko Retrascope - 0.2 Actions
6365 Retrascope Bug Closed Normal src/test/vhdl/example/example.vhd: IllegalArgumentException Sergey Smolov Mikhail Lebedev Retrascope - 0.1 Actions
6362 Retrascope Bug Rejected Normal src/test/verilog/adder/adder4_testbench.v: wrong CFG model Sergey Smolov Mikhail Chupilko Retrascope - 0.1 Actions
6354 Retrascope Task Closed Normal Collapsing group node for Module Sergey Smolov Alexander Protsenko Retrascope - 0.1 Actions
6353 Retrascope Bug Closed Normal Case children of one Switch node can have equal NodeValue Sergey Smolov Sergey Smolov Retrascope - 0.1 Actions
6350 Retrascope Task Closed Normal EfsmConflictExtractor wiki documentation Sergey Smolov Mikhail Lebedev Retrascope - 0.1 Actions
6336 Retrascope Task Closed Normal jUnit tests for EfsmConflictExtractor Sergey Smolov Mikhail Lebedev Retrascope - 0.1 Actions
6335 Retrascope Bug Closed Normal fifo.v: non-constant number of extracted EFSMs' transitions Sergey Smolov Sergey Smolov Retrascope - 0.1 Actions
6331 Retrascope Task Closed Normal look into unused classes Sergey Smolov Sergey Smolov Actions
6327 Retrascope Task Closed Normal log messages class Sergey Smolov Sergey Smolov Retrascope - 0.1 Actions
6301 Retrascope Task Closed Normal unused code Sergey Smolov Sergey Smolov Retrascope - 1.0 Actions
6293 Retrascope Bug Closed Normal XmlTestParserTestCase: NoSuchMethodException Sergey Smolov Igor Melnichenko Retrascope - 0.1 Actions
6281 Retrascope Bug Closed Normal EfsmTestGeneratorVhdlTestCase: Efsm.UNINITIALISED_STATE isn't supported yet Sergey Smolov Sergey Smolov Retrascope - 0.1 Actions
6280 Retrascope Bug Closed Normal TestVhdlTestbenchPrinterVhdlTestCase: The exception has occurred while printing test pattern file Sergey Smolov Igor Melnichenko Retrascope - 0.1 Actions
6279 Retrascope Bug Closed Normal TestXmlPrinterTestCase: IllegalArgumentException: Output file name isn't specified Sergey Smolov Igor Melnichenko Retrascope - 0.1 Actions
6241 MicroTESK Bug Closed Normal Generated assembler files contain tab-only lines Sergey Smolov Andrei Tatarnikov MicroTESK - 2.2 Actions
6108 MicroTESK Task Closed Normal create environment variable(s) for SMT solver(s) Sergey Smolov Andrei Tatarnikov MicroTESK - 2.2 Actions
6106 MicroTESK Bug Closed Normal zero opcodes for instructions in Tarmac log Sergey Smolov Andrei Tatarnikov MicroTESK - 2.2 Actions
6061 Retrascope Task Closed Normal EFSM-based transition assertion generator Sergey Smolov Sergey Smolov Retrascope - 1.0 Actions
6060 Retrascope Task Closed Normal Add plasma to project test suite Sergey Smolov Sergey Smolov Retrascope - 0.2 Actions
6059 Retrascope Task Closed Normal Simple solver for "x && !x" constraints Sergey Smolov Sergey Smolov Retrascope - 0.1 Actions
6051 Retrascope Task Closed Normal state-like variable names option Sergey Smolov Sergey Smolov Retrascope - 0.1 Actions
6049 Retrascope Task Closed Normal VHDL test printer: write documentation to project wiki Sergey Smolov Igor Melnichenko Retrascope - 0.1 Actions
6041 Retrascope Task Closed Normal move to gradle based build system Sergey Smolov Sergey Smolov Retrascope - 0.1 Actions
5993 Fortress Task Closed Normal boolean ExprUtils.isKind(Node.Kind kind, Node ... nodes) Sergey Smolov Andrei Tatarnikov Fortress - 0.4 Actions
5966 MicroTESK Bug Closed Normal mark shell scripts as executable in the distribution tar.gz archive Sergey Smolov Sergey Smolov MicroTESK - 2.5 Actions
5907 Fortress Task Closed Normal boolean areOfType(DataTypeId id, Node ... nodes) Sergey Smolov Andrei Tatarnikov Fortress - 0.3 Actions
5904 Retrascope Task Closed Normal save jUnit test results in build/test-results Sergey Smolov Sergey Smolov Retrascope - 0.1 Actions
5897 Retrascope Task Closed Normal fix javadoc for methods using InvariantChecks.checkNotNull Sergey Smolov Sergey Smolov Retrascope - 0.1 Actions
5896 Retrascope Task Closed Normal remove parameterized collections from public method interfaces Sergey Smolov Sergey Smolov Retrascope - 0.1 Actions
5887 Retrascope Task Closed Normal rename 'decider_parser.vhd' Sergey Smolov Igor Melnichenko Retrascope - 0.1 Actions
5881 Verilog Translator Task Closed Normal keep file names in the AST top nodes Sergey Smolov Sergey Smolov Verilog Translator - 0.1 Actions
5875 Retrascope Task Closed Normal Check state/transition count for extracted EFSM models Sergey Smolov Sergey Smolov Retrascope - 0.1 Actions
5872 Retrascope Task Closed Normal HDL file meta info Sergey Smolov Sergey Smolov Retrascope - 0.1 Actions
5871 Retrascope Bug Closed Normal ru.ispras.retrascope.test.printer.testbench -> ru.ispras.retrascope.engine.test.printer.testbench Sergey Smolov Igor Melnichenko Retrascope - 0.1 Actions
5870 Retrascope Task Closed Normal Retrascope exceptions Sergey Smolov Igor Melnichenko Retrascope - 0.1 Actions
5868 Retrascope Task Closed Normal Migrate to Fortress 0.4 Sergey Smolov Sergey Smolov Retrascope - 0.1 Actions
5832 Retrascope Task Closed Normal print some info about failed tests Sergey Smolov Sergey Smolov Retrascope - 0.1 Actions
5831 Retrascope Bug Closed Normal EfsmSimulator.java -> Tag @see: can't find getResetGuardedAction() in ru.ispras.retrascope.model.efsm.Efsm Sergey Smolov Igor Melnichenko Retrascope - 0.1 Actions
5828 Retrascope Bug Closed Normal TestVhdlTestbenchPrinterVhdlTestCase -> IllegalArgumentException: Unexpected event value: true Sergey Smolov Igor Melnichenko Retrascope - 0.1 Actions
5827 Retrascope Bug Closed Normal TestVhdlTestbenchPrinterDummyTestCase -> NoSuchFileException Sergey Smolov Igor Melnichenko Retrascope - 0.1 Actions
5778 Retrascope Bug Closed Normal ru.ispras.retrascope.engine.testbench.TestVhdlTestbenchPrinterTestCase -> java.util.NoSuchElementException Sergey Smolov Igor Melnichenko Retrascope - 0.1 Actions
5756 Retrascope Task Closed Normal EFSM pre-initial state + initialization action Sergey Smolov Sergey Smolov Retrascope - 0.1 Actions
5736 Retrascope Bug Closed Normal EfsmSimulator.substituteVariables(EfsmSimulator.java:736) -> NullPointerException Sergey Smolov Igor Melnichenko Retrascope - 0.1 Actions
5711 Retrascope Task Closed Normal Check generated *.smv files with external model checker Sergey Smolov Mikhail Lebedev Retrascope - 1.0 Actions
5709 Retrascope Bug Closed Normal TestMinimiser.java:43: warning - @param argument "test" is not a parameter name. Sergey Smolov Igor Melnichenko Retrascope - 0.1 Actions
5704 Retrascope Task Closed Normal try to find a way to remove 'toplevel' option Sergey Smolov Sergey Smolov Retrascope - 0.1 Actions
5702 Retrascope IDE Task New Normal [tool] create Retrascope icon Sergey Smolov Maxim Chudnov Retrascope IDE - 0.1 Actions
5696 Retrascope Task Closed Normal exclude sandbox & test folder from distribution Sergey Smolov Sergey Smolov Retrascope - 0.1 Actions
5695 Retrascope Task Closed Normal mark retrascope.sh as executable automatically Sergey Smolov Sergey Smolov Retrascope - 0.1 Actions
5694 Retrascope Task Closed Normal collect the *.smt2 files and analyse constraints Sergey Smolov Sergey Smolov Retrascope - 0.1 Actions
5692 Retrascope Bug Rejected Normal FATE/FATE+ hangs on b03 with Java 1.8 Sergey Smolov Igor Melnichenko Actions
(401-500/688) Per page: 25, 50, 100

Also available in: Atom CSV PDF