Project

General

Profile

Issues

Filters

Apply Clear

# Project Tracker Status Priority Subject Author Assignee Target version
5433 Fortress Task Closed Normal [test] write executable SMT-LIB code at testcase comments Sergey Smolov Artem Kotsynyak Fortress - 0.3 Actions
5443 Retrascope Bug Closed Normal [test][engine][media] TestVhdlTestbenchPrinterTestCase -> java.lang.RuntimeException: The exception has occurred while printing test pattern file Sergey Smolov Igor Melnichenko Retrascope - 0.1 Actions
5446 Retrascope Task Closed Normal [efsm][examples] Добавить мета-информацию в B04/B13 Sergey Smolov Sergey Smolov Retrascope - 0.1 Actions
5447 Fortress Task Closed High [transformer][ruleset] стандартизация константных выражений вида "x EQ y" Sergey Smolov Artem Kotsynyak Fortress - 0.3 Actions
5453 Fortress Bug Closed High [arrays] Unexpected solver output: " (INSTQUEUE ((as const (Array Int Int)) 0))" Sergey Smolov Artem Kotsynyak Fortress - 0.3 Actions
5455 Verilog Translator Task Closed Normal устранить зависимость от ANTLRWorks Sergey Smolov Alexander Kamkin Verilog Translator - 0.1 Actions
5456 Retrascope Task Closed Normal [structure] Замечания по структуре каталогов Sergey Smolov Igor Melnichenko Retrascope - 0.1 Actions
5457 Retrascope Bug Closed Normal [javadoc] Поправить комментарий в классе engine.efsm.testgen.ulisse.PercolationCoefficient Sergey Smolov Igor Melnichenko Retrascope - 0.1 Actions
5459 Retrascope Task Closed Normal implement EngineFrontend/EngineBackend Sergey Smolov Sergey Smolov Retrascope - 0.1 Actions
5461 Fortress Bug Closed High [arrays] Insufficient arrays support Sergey Smolov Artem Kotsynyak Fortress - 0.3 Actions
5462 Fortress Task Closed Normal [arrays] arrays initialization is inconvenient Sergey Smolov Artem Kotsynyak Fortress - 0.3 Actions
5464 Fortress Task Closed High [solver] boolean expressions casting into bit vectors Sergey Smolov Andrei Tatarnikov Fortress - 0.3 Actions
5465 Fortress Task Closed Normal [z3][solver] solver errors elaboration scheme Sergey Smolov Andrei Tatarnikov Fortress - 0.3 Actions
5466 Fortress Task Closed High [solver] print the input constraint when solver returns ERROR/UNKNOWN verdict Sergey Smolov Andrei Tatarnikov Fortress - 0.3 Actions
5471 Retrascope Task Closed Normal [structure] Rename *ing packages Sergey Smolov Igor Melnichenko Retrascope - 0.1 Actions
5478 Fortress Task Closed Normal Implement Transformer.reduce(Node expression) Sergey Smolov Artem Kotsynyak Fortress - 0.4 Actions
5481 Retrascope Task Closed Normal [structure] remove raw packages from main build folder Sergey Smolov Sergey Smolov Retrascope - 0.1 Actions
5482 Retrascope Task Closed Normal [wiki] documentation for 0.1-alpha Sergey Smolov Sergey Smolov Retrascope - 0.1 Actions
5492 Verilog Translator Bug Closed Normal retrascope + sapic.v = java.lang.IllegalStateException: Operand is not a constant integer value: 00000000000000000000000000000011 Sergey Smolov Alexander Kamkin Verilog Translator - 0.1 Actions
5494 Retrascope Task Closed Normal [structure] remove ru.ispras.retrascope.engine.efsm.testgen.heuristic empty package Sergey Smolov Igor Melnichenko Retrascope - 0.1 Actions
5495 Retrascope Task Closed Normal [structure] move ru.ispras.retrascope.testbench.media package to ru.ispras.retrascope.result.testbench Sergey Smolov Igor Melnichenko Retrascope - 0.1 Actions
5497 Retrascope Task Closed Normal [efsm][extractor][conflict][jaxb] rename jaxb-classes Sergey Smolov Mikhail Lebedev Retrascope - 0.1 Actions
5498 Retrascope Task Closed Normal [model][basis][memory] rename IMemory interface Sergey Smolov Igor Melnichenko Retrascope - 0.1 Actions
5499 Retrascope Bug Closed Normal [efsm][extractor][conflict] move & rename EfsmConflicts class Sergey Smolov Mikhail Lebedev Retrascope - 0.1 Actions
5500 Retrascope Bug Closed Normal [engine][testbench] possible bug in TestVhdlTestbenchPrinter engine id Sergey Smolov Igor Melnichenko Retrascope - 0.1 Actions
5501 Retrascope Task Closed Normal [efsm][generator][test] Class 'EfsmAtomicTestGenerator' is never used Sergey Smolov Igor Melnichenko Retrascope - 0.1 Actions
5502 Retrascope Bug Closed Normal [engine][testbench] 'engine' subpackages must not contain entities Sergey Smolov Igor Melnichenko Retrascope - 0.1 Actions
5503 Retrascope Task Closed Normal [parser][basis][backend] implement "atomic hammock" backend Sergey Smolov Sergey Smolov Retrascope - 0.1 Actions
5505 Retrascope Bug Closed Normal [javadoc] warnings while ConflictModel processing Sergey Smolov Mikhail Lebedev Retrascope - 0.1 Actions
5506 Retrascope Bug Closed Normal [javadoc] warning while EfsmAtomicFateTestGenerator processing Sergey Smolov Igor Melnichenko Retrascope - 0.1 Actions
5508 Retrascope Bug Closed Normal [cfg][printer][smv] java.io.IOException Sergey Smolov Mikhail Lebedev Retrascope - 0.1 Actions
5509 Retrascope Bug Closed Normal [cfg][printer][smv] javadoc warnings Sergey Smolov Mikhail Lebedev Retrascope - 0.1 Actions
5510 Retrascope Bug Closed High [efsm][generator][test] RandomFateSequenceIterator compilation error Sergey Smolov Igor Melnichenko Retrascope - 0.1 Actions
5524 Retrascope Bug Closed High [engine][xml] wrong package for TestXmlPrinter Sergey Smolov Igor Melnichenko Retrascope - 0.1 Actions
5525 Retrascope Bug Closed High [engine][xml] wrong package for TestXmlPrinterTestCase Sergey Smolov Igor Melnichenko Retrascope - 0.1 Actions
5528 Retrascope Bug Closed High [engine][testbench] java.nio.file.FileAlreadyExistsException: decider_parser.vhd Sergey Smolov Igor Melnichenko Retrascope - 0.1 Actions
5536 Retrascope Bug Closed Normal [efsm][generator][test] EfsmTestGeneratorVhdlTestCase -> java.lang.RuntimeException: Unexpected simulation result Sergey Smolov Igor Melnichenko Retrascope - 0.1 Actions
5537 Retrascope Task Closed Normal [efsm][generator][test] make log shorter Sergey Smolov Igor Melnichenko Retrascope - 0.1 Actions
5538 Retrascope Bug Closed Normal [efsm][generator][test] EfsmFateTestGeneratorVhdlTestCase -> java.lang.RuntimeException: Unexpected simulation result. Sergey Smolov Igor Melnichenko Retrascope - 0.1 Actions
5540 Retrascope Bug Closed Normal [javadoc] EfsmSimulator.java:119: warning - @param argument "efsm" is not a parameter name. Sergey Smolov Igor Melnichenko Retrascope - 0.1 Actions
5541 Retrascope Task Closed High [engine][printer][smv] move engine.printer.smv package to sandbox Sergey Smolov Mikhail Lebedev Retrascope - 0.1 Actions
5548 Retrascope Task Closed Low elaborate minimips modules Sergey Smolov Sergey Smolov Retrascope - 0.2 Actions
5549 Retrascope Task Closed Normal [vhdl][cfg][parser] add support of instantiation Sergey Smolov Sergey Smolov Retrascope - 0.2 Actions
5561 Retrascope Task Closed Normal [project] use InvariantChecks if needed Sergey Smolov Sergey Smolov Retrascope - 0.1 Actions
5563 Fortress Task Closed Normal [data] implement DataTypeId.isLogic(Enum<?> id) method Sergey Smolov Andrei Tatarnikov Fortress - 0.3 Actions
5567 Verilog Translator Bug Closed High VerilogStaticChecker.ExpressionVisitor is not abstract and does not override abstract method getOperandOrder() in ExprTreeVisitor Sergey Smolov Alexander Kamkin Verilog Translator - 0.1 Actions
5568 Retrascope Task Closed Normal [cfg] support process variable declarations Sergey Smolov Sergey Smolov Retrascope - 0.1 Actions
5569 Retrascope Task Closed Normal support process variable declarations Sergey Smolov Sergey Smolov Retrascope - 0.1 Actions
5570 Retrascope Task Closed Low [build] build.xml: extract equal code parts from 'test'/'test.short' targets Sergey Smolov Sergey Smolov Retrascope - 0.1 Actions
5572 Retrascope Bug Closed Normal [efsm][simulator] b10: Failed to resolve the assignment constraint Sergey Smolov Igor Melnichenko Retrascope - 0.1 Actions
5576 Fortress Task Closed Normal Сalculate data type of expression with BVCONCAT Sergey Smolov Andrei Tatarnikov Fortress - 0.3 Actions
5578 Retrascope Task Closed Normal [verilog][parser][cfg] add support of multiple assignments Sergey Smolov Mikhail Chupilko Retrascope - 0.1 Actions
5579 Retrascope Task Closed Normal [cfg] simplify the Assignment class Sergey Smolov Sergey Smolov Retrascope - 0.1 Actions
5580 Retrascope Developer Request Closed Normal [efsm][conflict][extractor][jaxb] can GuardedAction() call at the JaxbGuardedActionAdapter be substituted by something else Sergey Smolov Mikhail Lebedev Retrascope - 0.1 Actions
5588 Retrascope Task Closed Normal extend HDL test suite Sergey Smolov Sergey Smolov Retrascope - 1.0 Actions
5589 Retrascope Task Closed Normal [efsm][extraction] state-like variables use/def statistics Sergey Smolov Sergey Smolov Retrascope - 0.1 Actions
5590 Retrascope Task Closed Normal [efsm][extraction] implement an EFSM initial state & 'reset' signal heuristics Sergey Smolov Sergey Smolov Retrascope - 0.1 Actions
5591 Retrascope Task Closed Normal [project] run scripts for Unix/Windows Sergey Smolov Sergey Smolov Retrascope - 0.1 Actions
5592 Retrascope Task Closed Normal [project] prepare tar.gz distribution for future release Sergey Smolov Sergey Smolov Retrascope - 0.1 Actions
5599 Fortress Task Closed Normal [expression] implement getDataTypeId() method Sergey Smolov Andrei Tatarnikov Fortress - 0.3 Actions
5600 Fortress Task Closed High [transformer][ruleset] implement ITE rules Sergey Smolov Artem Kotsynyak Fortress - 0.3 Actions
5608 Retrascope Bug Closed High [efsm][generator][test][fate] FATE generator hangs at b03 description from ITC'99 Sergey Smolov Igor Melnichenko Retrascope - 0.1 Actions
5651 Verilog Translator Task Closed Normal Translate logic operation results into Boolean expressions Sergey Smolov Sergey Smolov Verilog Translator - 0.1 Actions
5680 Retrascope Bug Closed Urgent [efsm][generator][test][fate] DirectedFateGenerator.generateSequence -> NullPointerException Sergey Smolov Igor Melnichenko Retrascope - 0.1 Actions
5683 Retrascope Task Closed Normal STD_LOGIC/STD_ULOGIC processing Sergey Smolov Sergey Smolov Retrascope - 0.1 Actions
5688 Retrascope Task Closed Normal implement test-to-VHDL printer Sergey Smolov Igor Melnichenko Retrascope - 0.1 Actions
5689 Retrascope Task Closed High implement test-to-Verilog printer Sergey Smolov Sergey Smolov Retrascope - 0.2 Actions
5694 Retrascope Task Closed Normal collect the *.smt2 files and analyse constraints Sergey Smolov Sergey Smolov Retrascope - 0.1 Actions
5695 Retrascope Task Closed Normal mark retrascope.sh as executable automatically Sergey Smolov Sergey Smolov Retrascope - 0.1 Actions
5696 Retrascope Task Closed Normal exclude sandbox & test folder from distribution Sergey Smolov Sergey Smolov Retrascope - 0.1 Actions
5704 Retrascope Task Closed Normal try to find a way to remove 'toplevel' option Sergey Smolov Sergey Smolov Retrascope - 0.1 Actions
5709 Retrascope Bug Closed Normal TestMinimiser.java:43: warning - @param argument "test" is not a parameter name. Sergey Smolov Igor Melnichenko Retrascope - 0.1 Actions
5711 Retrascope Task Closed Normal Check generated *.smv files with external model checker Sergey Smolov Mikhail Lebedev Retrascope - 1.0 Actions
5715 Retrascope Bug Closed High EfsmTestGenerator.java:138: error: method put in interface Map<K,V> cannot be applied to given types -> traversedPaths.put(efsm, new HashSet<>()); Sergey Smolov Igor Melnichenko Retrascope - 0.1 Actions
5719 Retrascope Bug Closed Urgent EFSM Test Generator hangs on b11 Sergey Smolov Igor Melnichenko Retrascope - 0.1 Actions
5736 Retrascope Bug Closed Normal EfsmSimulator.substituteVariables(EfsmSimulator.java:736) -> NullPointerException Sergey Smolov Igor Melnichenko Retrascope - 0.1 Actions
5755 Retrascope Task Closed Low use Zamia IG visitors & walkers Sergey Smolov Sergey Smolov Retrascope - 0.1 Actions
5756 Retrascope Task Closed Normal EFSM pre-initial state + initialization action Sergey Smolov Sergey Smolov Retrascope - 0.1 Actions
5778 Retrascope Bug Closed Normal ru.ispras.retrascope.engine.testbench.TestVhdlTestbenchPrinterTestCase -> java.util.NoSuchElementException Sergey Smolov Igor Melnichenko Retrascope - 0.1 Actions
5802 Fortress Task Closed High NodeValue newZero(DataType dataType) Sergey Smolov Andrei Tatarnikov Fortress - 0.3 Actions
5827 Retrascope Bug Closed Normal TestVhdlTestbenchPrinterDummyTestCase -> NoSuchFileException Sergey Smolov Igor Melnichenko Retrascope - 0.1 Actions
5828 Retrascope Bug Closed Normal TestVhdlTestbenchPrinterVhdlTestCase -> IllegalArgumentException: Unexpected event value: true Sergey Smolov Igor Melnichenko Retrascope - 0.1 Actions
5831 Retrascope Bug Closed Normal EfsmSimulator.java -> Tag @see: can't find getResetGuardedAction() in ru.ispras.retrascope.model.efsm.Efsm Sergey Smolov Igor Melnichenko Retrascope - 0.1 Actions
5832 Retrascope Task Closed Normal print some info about failed tests Sergey Smolov Sergey Smolov Retrascope - 0.1 Actions
5861 Fortress Task Closed Low static boolean containsSingleObject(Collection<?> collection) Sergey Smolov Andrei Tatarnikov Fortress - 0.3 Actions
5868 Retrascope Task Closed Normal Migrate to Fortress 0.4 Sergey Smolov Sergey Smolov Retrascope - 0.1 Actions
5870 Retrascope Task Closed Normal Retrascope exceptions Sergey Smolov Igor Melnichenko Retrascope - 0.1 Actions
5871 Retrascope Bug Closed Normal ru.ispras.retrascope.test.printer.testbench -> ru.ispras.retrascope.engine.test.printer.testbench Sergey Smolov Igor Melnichenko Retrascope - 0.1 Actions
5872 Retrascope Task Closed Normal HDL file meta info Sergey Smolov Sergey Smolov Retrascope - 0.1 Actions
5873 Retrascope Bug Closed High missing transitions in b04 EFSM Sergey Smolov Sergey Smolov Retrascope - 0.1 Actions
5875 Retrascope Task Closed Normal Check state/transition count for extracted EFSM models Sergey Smolov Sergey Smolov Retrascope - 0.1 Actions
5881 Verilog Translator Task Closed Normal keep file names in the AST top nodes Sergey Smolov Sergey Smolov Verilog Translator - 0.1 Actions
5887 Retrascope Task Closed Normal rename 'decider_parser.vhd' Sergey Smolov Igor Melnichenko Retrascope - 0.1 Actions
5896 Retrascope Task Closed Normal remove parameterized collections from public method interfaces Sergey Smolov Sergey Smolov Retrascope - 0.1 Actions
5897 Retrascope Task Closed Normal fix javadoc for methods using InvariantChecks.checkNotNull Sergey Smolov Sergey Smolov Retrascope - 0.1 Actions
5904 Retrascope Task Closed Normal save jUnit test results in build/test-results Sergey Smolov Sergey Smolov Retrascope - 0.1 Actions
5907 Fortress Task Closed Normal boolean areOfType(DataTypeId id, Node ... nodes) Sergey Smolov Andrei Tatarnikov Fortress - 0.3 Actions
5966 MicroTESK Bug Closed Normal mark shell scripts as executable in the distribution tar.gz archive Sergey Smolov Sergey Smolov MicroTESK - 2.5 Actions
5967 MicroTESK Task Closed Low one directory for all components of distribution Sergey Smolov Andrei Tatarnikov MicroTESK - 2.2 Actions
5985 Fortress Task Closed High Node ExprUtils.getEquation(Node target, Node value) Sergey Smolov Andrei Tatarnikov Fortress - 0.4 Actions
(201-300/688) Per page: 25, 50, 100

Also available in: Atom CSV PDF