Project

General

Profile

Issues

Filters

Apply Clear

# Project Tracker Status Priority Subject Author Assignee Target version
5142 Retrascope Task Closed Normal [wiki] Классификация Engine Sergey Smolov Sergey Smolov Retrascope - 0.1 Actions
5143 Retrascope Task Closed Normal [cfg][extractor][iface] CfgIfaceExtractor Sergey Smolov Sergey Smolov Retrascope - 0.1 Actions
5145 Retrascope Task Closed Normal [testbench] Iface Sergey Smolov Sergey Smolov Retrascope - 0.1 Actions
5157 Retrascope Task Closed Normal [cfg] addNewVariable(DataType type) Sergey Smolov Sergey Smolov Retrascope - 0.1 Actions
5161 Retrascope Task Closed Normal [parser][cfg] Обработка циклов Sergey Smolov Sergey Smolov Retrascope - 0.2 Actions
5171 Retrascope Bug Closed Normal [efsm][testgen][test] ru.ispras.retrascope.util.XmlUtilTestCase -> NullPointerException Sergey Smolov Igor Melnichenko Retrascope - 0.1 Actions
5175 Retrascope Task Closed Normal [vhdl][parser] IG array elaboration Sergey Smolov Sergey Smolov Retrascope - 0.2 Actions
5226 Retrascope Task Closed Normal [cfg][printer][graphml] Узлы SOURCE и BASIC_BLOCK имеют одинаковый цвет Sergey Smolov Sergey Smolov Retrascope - 0.1 Actions
5247 Retrascope Task Closed Normal [basis] Набор идентификаторов Engine как опция командной строки Retrascope Sergey Smolov Alexander Kamkin Retrascope - 0.1 Actions
5248 Retrascope Bug Closed Normal [efsm][testgen]FateTestCase -> java.lang.NumberFormatException: For input string: "-2975976114" Sergey Smolov Igor Melnichenko Retrascope - 0.1 Actions
5249 Retrascope Task Closed High [basis] Настройка Retrascope для работы с SMT-решателями Sergey Smolov Alexander Kamkin Retrascope - 0.1 Actions
5256 Retrascope Bug Closed Normal [cfg][printer][graphml] Не отображать вершины типа Case Sergey Smolov Sergey Smolov Retrascope - 0.1 Actions
5258 Retrascope Task Closed High [basis] Обработка циклических зависимостей разных Engine Sergey Smolov Alexander Kamkin Retrascope - 0.1 Actions
5263 Retrascope Bug Rejected High [efsm][generator][test] EfsmTestGeneratorTestCase -> java.lang.OutOfMemoryError: Java heap space Sergey Smolov Igor Melnichenko Retrascope - 0.1 Actions
5320 Retrascope Task Rejected Normal [cfg] Методы копирования вершин CFG Sergey Smolov Sergey Smolov Retrascope - 0.2 Actions
5322 Retrascope Task Closed Normal [cgaa][transformer][efsm] Продумать и реализовать эвристику определения reset Sergey Smolov Sergey Smolov Retrascope - 0.2 Actions
5394 Retrascope Task Closed High [cgaa][transformer][efsm] реализовать построение переходов EFSM Sergey Smolov Sergey Smolov Retrascope - 0.1 Actions
5395 Retrascope Task Closed Normal [cfg] getOnlyChild(), getOnlyParent() Sergey Smolov Sergey Smolov Retrascope - 0.2 Actions
5398 Retrascope Task Closed Normal [verilog][parser][cfg] Преобразование констант в NodeValue Sergey Smolov Mikhail Chupilko Retrascope - 0.1 Actions
5404 Retrascope Bug Closed Normal [verilog][parser][cfg] java.lang.IllegalArgumentException: Unsupported data type: UNKNOWN Sergey Smolov Alexander Kamkin Retrascope - 0.1 Actions
5413 Retrascope Task Closed High [model][basis] add HdlType field to VariableData class Sergey Smolov Sergey Smolov Retrascope - 0.1 Actions
5414 Retrascope Bug Closed Normal [engine][xml]/[util]: TransducedAccessor.get -> NullPointerException Sergey Smolov Igor Melnichenko Retrascope - 0.1 Actions
5416 Retrascope Task Closed Normal [model][basis] мета-информация Sergey Smolov Sergey Smolov Retrascope - 0.1 Actions
5420 Retrascope Task Closed Normal [util] метод fillNodeWithValues заменить на Transformer.substituteAllBindings Sergey Smolov Igor Melnichenko Retrascope - 0.1 Actions
5443 Retrascope Bug Closed Normal [test][engine][media] TestVhdlTestbenchPrinterTestCase -> java.lang.RuntimeException: The exception has occurred while printing test pattern file Sergey Smolov Igor Melnichenko Retrascope - 0.1 Actions
5446 Retrascope Task Closed Normal [efsm][examples] Добавить мета-информацию в B04/B13 Sergey Smolov Sergey Smolov Retrascope - 0.1 Actions
5456 Retrascope Task Closed Normal [structure] Замечания по структуре каталогов Sergey Smolov Igor Melnichenko Retrascope - 0.1 Actions
5457 Retrascope Bug Closed Normal [javadoc] Поправить комментарий в классе engine.efsm.testgen.ulisse.PercolationCoefficient Sergey Smolov Igor Melnichenko Retrascope - 0.1 Actions
5459 Retrascope Task Closed Normal implement EngineFrontend/EngineBackend Sergey Smolov Sergey Smolov Retrascope - 0.1 Actions
5471 Retrascope Task Closed Normal [structure] Rename *ing packages Sergey Smolov Igor Melnichenko Retrascope - 0.1 Actions
5481 Retrascope Task Closed Normal [structure] remove raw packages from main build folder Sergey Smolov Sergey Smolov Retrascope - 0.1 Actions
5482 Retrascope Task Closed Normal [wiki] documentation for 0.1-alpha Sergey Smolov Sergey Smolov Retrascope - 0.1 Actions
5494 Retrascope Task Closed Normal [structure] remove ru.ispras.retrascope.engine.efsm.testgen.heuristic empty package Sergey Smolov Igor Melnichenko Retrascope - 0.1 Actions
5495 Retrascope Task Closed Normal [structure] move ru.ispras.retrascope.testbench.media package to ru.ispras.retrascope.result.testbench Sergey Smolov Igor Melnichenko Retrascope - 0.1 Actions
5497 Retrascope Task Closed Normal [efsm][extractor][conflict][jaxb] rename jaxb-classes Sergey Smolov Mikhail Lebedev Retrascope - 0.1 Actions
5498 Retrascope Task Closed Normal [model][basis][memory] rename IMemory interface Sergey Smolov Igor Melnichenko Retrascope - 0.1 Actions
5499 Retrascope Bug Closed Normal [efsm][extractor][conflict] move & rename EfsmConflicts class Sergey Smolov Mikhail Lebedev Retrascope - 0.1 Actions
5500 Retrascope Bug Closed Normal [engine][testbench] possible bug in TestVhdlTestbenchPrinter engine id Sergey Smolov Igor Melnichenko Retrascope - 0.1 Actions
5501 Retrascope Task Closed Normal [efsm][generator][test] Class 'EfsmAtomicTestGenerator' is never used Sergey Smolov Igor Melnichenko Retrascope - 0.1 Actions
5502 Retrascope Bug Closed Normal [engine][testbench] 'engine' subpackages must not contain entities Sergey Smolov Igor Melnichenko Retrascope - 0.1 Actions
5503 Retrascope Task Closed Normal [parser][basis][backend] implement "atomic hammock" backend Sergey Smolov Sergey Smolov Retrascope - 0.1 Actions
5504 Retrascope Task New Normal add channels between EFSMs Sergey Smolov Mikhail Lebedev Retrascope - 1.2 Actions
5505 Retrascope Bug Closed Normal [javadoc] warnings while ConflictModel processing Sergey Smolov Mikhail Lebedev Retrascope - 0.1 Actions
5506 Retrascope Bug Closed Normal [javadoc] warning while EfsmAtomicFateTestGenerator processing Sergey Smolov Igor Melnichenko Retrascope - 0.1 Actions
5507 Retrascope Task Rejected Normal [engine][basis] implement PrinterEngine Sergey Smolov Sergey Smolov Retrascope - 0.1 Actions
5508 Retrascope Bug Closed Normal [cfg][printer][smv] java.io.IOException Sergey Smolov Mikhail Lebedev Retrascope - 0.1 Actions
5509 Retrascope Bug Closed Normal [cfg][printer][smv] javadoc warnings Sergey Smolov Mikhail Lebedev Retrascope - 0.1 Actions
5510 Retrascope Bug Closed High [efsm][generator][test] RandomFateSequenceIterator compilation error Sergey Smolov Igor Melnichenko Retrascope - 0.1 Actions
5524 Retrascope Bug Closed High [engine][xml] wrong package for TestXmlPrinter Sergey Smolov Igor Melnichenko Retrascope - 0.1 Actions
5525 Retrascope Bug Closed High [engine][xml] wrong package for TestXmlPrinterTestCase Sergey Smolov Igor Melnichenko Retrascope - 0.1 Actions
5526 Retrascope Task Rejected Normal Retrascope engines configuration Sergey Smolov Alexander Kamkin Actions
5528 Retrascope Bug Closed High [engine][testbench] java.nio.file.FileAlreadyExistsException: decider_parser.vhd Sergey Smolov Igor Melnichenko Retrascope - 0.1 Actions
5536 Retrascope Bug Closed Normal [efsm][generator][test] EfsmTestGeneratorVhdlTestCase -> java.lang.RuntimeException: Unexpected simulation result Sergey Smolov Igor Melnichenko Retrascope - 0.1 Actions
5537 Retrascope Task Closed Normal [efsm][generator][test] make log shorter Sergey Smolov Igor Melnichenko Retrascope - 0.1 Actions
5538 Retrascope Bug Closed Normal [efsm][generator][test] EfsmFateTestGeneratorVhdlTestCase -> java.lang.RuntimeException: Unexpected simulation result. Sergey Smolov Igor Melnichenko Retrascope - 0.1 Actions
5540 Retrascope Bug Closed Normal [javadoc] EfsmSimulator.java:119: warning - @param argument "efsm" is not a parameter name. Sergey Smolov Igor Melnichenko Retrascope - 0.1 Actions
5541 Retrascope Task Closed High [engine][printer][smv] move engine.printer.smv package to sandbox Sergey Smolov Mikhail Lebedev Retrascope - 0.1 Actions
5548 Retrascope Task Closed Low elaborate minimips modules Sergey Smolov Sergey Smolov Retrascope - 0.2 Actions
5549 Retrascope Task Closed Normal [vhdl][cfg][parser] add support of instantiation Sergey Smolov Sergey Smolov Retrascope - 0.2 Actions
5561 Retrascope Task Closed Normal [project] use InvariantChecks if needed Sergey Smolov Sergey Smolov Retrascope - 0.1 Actions
5568 Retrascope Task Closed Normal [cfg] support process variable declarations Sergey Smolov Sergey Smolov Retrascope - 0.1 Actions
5569 Retrascope Task Closed Normal support process variable declarations Sergey Smolov Sergey Smolov Retrascope - 0.1 Actions
5570 Retrascope Task Closed Low [build] build.xml: extract equal code parts from 'test'/'test.short' targets Sergey Smolov Sergey Smolov Retrascope - 0.1 Actions
5572 Retrascope Bug Closed Normal [efsm][simulator] b10: Failed to resolve the assignment constraint Sergey Smolov Igor Melnichenko Retrascope - 0.1 Actions
5578 Retrascope Task Closed Normal [verilog][parser][cfg] add support of multiple assignments Sergey Smolov Mikhail Chupilko Retrascope - 0.1 Actions
5579 Retrascope Task Closed Normal [cfg] simplify the Assignment class Sergey Smolov Sergey Smolov Retrascope - 0.1 Actions
5580 Retrascope Developer Request Closed Normal [efsm][conflict][extractor][jaxb] can GuardedAction() call at the JaxbGuardedActionAdapter be substituted by something else Sergey Smolov Mikhail Lebedev Retrascope - 0.1 Actions
5588 Retrascope Task Closed Normal extend HDL test suite Sergey Smolov Sergey Smolov Retrascope - 1.0 Actions
5589 Retrascope Task Closed Normal [efsm][extraction] state-like variables use/def statistics Sergey Smolov Sergey Smolov Retrascope - 0.1 Actions
5590 Retrascope Task Closed Normal [efsm][extraction] implement an EFSM initial state & 'reset' signal heuristics Sergey Smolov Sergey Smolov Retrascope - 0.1 Actions
5591 Retrascope Task Closed Normal [project] run scripts for Unix/Windows Sergey Smolov Sergey Smolov Retrascope - 0.1 Actions
5592 Retrascope Task Closed Normal [project] prepare tar.gz distribution for future release Sergey Smolov Sergey Smolov Retrascope - 0.1 Actions
5608 Retrascope Bug Closed High [efsm][generator][test][fate] FATE generator hangs at b03 description from ITC'99 Sergey Smolov Igor Melnichenko Retrascope - 0.1 Actions
5609 Retrascope Task Rejected Normal make process-local variables be efsm-model-global Sergey Smolov Sergey Smolov Retrascope - 0.1 Actions
5648 Retrascope Bug Rejected High EfsmSimulator.executeAssignment -> Unsupported data type of ranged variable: (MAP LOGIC_INTEGER LOGIC_INTEGER) Sergey Smolov Igor Melnichenko Retrascope - 0.2 Actions
5680 Retrascope Bug Closed Urgent [efsm][generator][test][fate] DirectedFateGenerator.generateSequence -> NullPointerException Sergey Smolov Igor Melnichenko Retrascope - 0.1 Actions
5683 Retrascope Task Closed Normal STD_LOGIC/STD_ULOGIC processing Sergey Smolov Sergey Smolov Retrascope - 0.1 Actions
5684 Retrascope Bug Rejected Low computeExpression -> LOGIC_BOOLEAN vs (MAP LOGIC_INTEGER LOGIC_BOOLEAN) Sergey Smolov Igor Melnichenko Retrascope - 0.2 Actions
5688 Retrascope Task Closed Normal implement test-to-VHDL printer Sergey Smolov Igor Melnichenko Retrascope - 0.1 Actions
5689 Retrascope Task Closed High implement test-to-Verilog printer Sergey Smolov Sergey Smolov Retrascope - 0.2 Actions
5692 Retrascope Bug Rejected Normal FATE/FATE+ hangs on b03 with Java 1.8 Sergey Smolov Igor Melnichenko Actions
5694 Retrascope Task Closed Normal collect the *.smt2 files and analyse constraints Sergey Smolov Sergey Smolov Retrascope - 0.1 Actions
5695 Retrascope Task Closed Normal mark retrascope.sh as executable automatically Sergey Smolov Sergey Smolov Retrascope - 0.1 Actions
5696 Retrascope Task Closed Normal exclude sandbox & test folder from distribution Sergey Smolov Sergey Smolov Retrascope - 0.1 Actions
5704 Retrascope Task Closed Normal try to find a way to remove 'toplevel' option Sergey Smolov Sergey Smolov Retrascope - 0.1 Actions
5709 Retrascope Bug Closed Normal TestMinimiser.java:43: warning - @param argument "test" is not a parameter name. Sergey Smolov Igor Melnichenko Retrascope - 0.1 Actions
5711 Retrascope Task Closed Normal Check generated *.smv files with external model checker Sergey Smolov Mikhail Lebedev Retrascope - 1.0 Actions
5715 Retrascope Bug Closed High EfsmTestGenerator.java:138: error: method put in interface Map<K,V> cannot be applied to given types -> traversedPaths.put(efsm, new HashSet<>()); Sergey Smolov Igor Melnichenko Retrascope - 0.1 Actions
5719 Retrascope Bug Closed Urgent EFSM Test Generator hangs on b11 Sergey Smolov Igor Melnichenko Retrascope - 0.1 Actions
5736 Retrascope Bug Closed Normal EfsmSimulator.substituteVariables(EfsmSimulator.java:736) -> NullPointerException Sergey Smolov Igor Melnichenko Retrascope - 0.1 Actions
5755 Retrascope Task Closed Low use Zamia IG visitors & walkers Sergey Smolov Sergey Smolov Retrascope - 0.1 Actions
5756 Retrascope Task Closed Normal EFSM pre-initial state + initialization action Sergey Smolov Sergey Smolov Retrascope - 0.1 Actions
5778 Retrascope Bug Closed Normal ru.ispras.retrascope.engine.testbench.TestVhdlTestbenchPrinterTestCase -> java.util.NoSuchElementException Sergey Smolov Igor Melnichenko Retrascope - 0.1 Actions
5827 Retrascope Bug Closed Normal TestVhdlTestbenchPrinterDummyTestCase -> NoSuchFileException Sergey Smolov Igor Melnichenko Retrascope - 0.1 Actions
5828 Retrascope Bug Closed Normal TestVhdlTestbenchPrinterVhdlTestCase -> IllegalArgumentException: Unexpected event value: true Sergey Smolov Igor Melnichenko Retrascope - 0.1 Actions
5831 Retrascope Bug Closed Normal EfsmSimulator.java -> Tag @see: can't find getResetGuardedAction() in ru.ispras.retrascope.model.efsm.Efsm Sergey Smolov Igor Melnichenko Retrascope - 0.1 Actions
5832 Retrascope Task Closed Normal print some info about failed tests Sergey Smolov Sergey Smolov Retrascope - 0.1 Actions
5868 Retrascope Task Closed Normal Migrate to Fortress 0.4 Sergey Smolov Sergey Smolov Retrascope - 0.1 Actions
5870 Retrascope Task Closed Normal Retrascope exceptions Sergey Smolov Igor Melnichenko Retrascope - 0.1 Actions
5871 Retrascope Bug Closed Normal ru.ispras.retrascope.test.printer.testbench -> ru.ispras.retrascope.engine.test.printer.testbench Sergey Smolov Igor Melnichenko Retrascope - 0.1 Actions
(201-300/688) Per page: 25, 50, 100

Also available in: Atom CSV PDF