Project

General

Profile

Issues

Filters

Apply Clear

# Project Tracker Status Priority Subject Author Assignee Target version
5648 Retrascope Bug Rejected High EfsmSimulator.executeAssignment -> Unsupported data type of ranged variable: (MAP LOGIC_INTEGER LOGIC_INTEGER) Sergey Smolov Igor Melnichenko Retrascope - 0.2 Actions
5651 Verilog Translator Task Closed Normal Translate logic operation results into Boolean expressions Sergey Smolov Sergey Smolov Verilog Translator - 0.1 Actions
5680 Retrascope Bug Closed Urgent [efsm][generator][test][fate] DirectedFateGenerator.generateSequence -> NullPointerException Sergey Smolov Igor Melnichenko Retrascope - 0.1 Actions
5683 Retrascope Task Closed Normal STD_LOGIC/STD_ULOGIC processing Sergey Smolov Sergey Smolov Retrascope - 0.1 Actions
5684 Retrascope Bug Rejected Low computeExpression -> LOGIC_BOOLEAN vs (MAP LOGIC_INTEGER LOGIC_BOOLEAN) Sergey Smolov Igor Melnichenko Retrascope - 0.2 Actions
5688 Retrascope Task Closed Normal implement test-to-VHDL printer Sergey Smolov Igor Melnichenko Retrascope - 0.1 Actions
5689 Retrascope Task Closed High implement test-to-Verilog printer Sergey Smolov Sergey Smolov Retrascope - 0.2 Actions
5692 Retrascope Bug Rejected Normal FATE/FATE+ hangs on b03 with Java 1.8 Sergey Smolov Igor Melnichenko Actions
5694 Retrascope Task Closed Normal collect the *.smt2 files and analyse constraints Sergey Smolov Sergey Smolov Retrascope - 0.1 Actions
5695 Retrascope Task Closed Normal mark retrascope.sh as executable automatically Sergey Smolov Sergey Smolov Retrascope - 0.1 Actions
5696 Retrascope Task Closed Normal exclude sandbox & test folder from distribution Sergey Smolov Sergey Smolov Retrascope - 0.1 Actions
5702 Retrascope IDE Task New Normal [tool] create Retrascope icon Sergey Smolov Maxim Chudnov Retrascope IDE - 0.1 Actions
5704 Retrascope Task Closed Normal try to find a way to remove 'toplevel' option Sergey Smolov Sergey Smolov Retrascope - 0.1 Actions
5709 Retrascope Bug Closed Normal TestMinimiser.java:43: warning - @param argument "test" is not a parameter name. Sergey Smolov Igor Melnichenko Retrascope - 0.1 Actions
5711 Retrascope Task Closed Normal Check generated *.smv files with external model checker Sergey Smolov Mikhail Lebedev Retrascope - 1.0 Actions
5715 Retrascope Bug Closed High EfsmTestGenerator.java:138: error: method put in interface Map<K,V> cannot be applied to given types -> traversedPaths.put(efsm, new HashSet<>()); Sergey Smolov Igor Melnichenko Retrascope - 0.1 Actions
5719 Retrascope Bug Closed Urgent EFSM Test Generator hangs on b11 Sergey Smolov Igor Melnichenko Retrascope - 0.1 Actions
5736 Retrascope Bug Closed Normal EfsmSimulator.substituteVariables(EfsmSimulator.java:736) -> NullPointerException Sergey Smolov Igor Melnichenko Retrascope - 0.1 Actions
5755 Retrascope Task Closed Low use Zamia IG visitors & walkers Sergey Smolov Sergey Smolov Retrascope - 0.1 Actions
5756 Retrascope Task Closed Normal EFSM pre-initial state + initialization action Sergey Smolov Sergey Smolov Retrascope - 0.1 Actions
5778 Retrascope Bug Closed Normal ru.ispras.retrascope.engine.testbench.TestVhdlTestbenchPrinterTestCase -> java.util.NoSuchElementException Sergey Smolov Igor Melnichenko Retrascope - 0.1 Actions
5802 Fortress Task Closed High NodeValue newZero(DataType dataType) Sergey Smolov Andrei Tatarnikov Fortress - 0.3 Actions
5827 Retrascope Bug Closed Normal TestVhdlTestbenchPrinterDummyTestCase -> NoSuchFileException Sergey Smolov Igor Melnichenko Retrascope - 0.1 Actions
5828 Retrascope Bug Closed Normal TestVhdlTestbenchPrinterVhdlTestCase -> IllegalArgumentException: Unexpected event value: true Sergey Smolov Igor Melnichenko Retrascope - 0.1 Actions
5831 Retrascope Bug Closed Normal EfsmSimulator.java -> Tag @see: can't find getResetGuardedAction() in ru.ispras.retrascope.model.efsm.Efsm Sergey Smolov Igor Melnichenko Retrascope - 0.1 Actions
5832 Retrascope Task Closed Normal print some info about failed tests Sergey Smolov Sergey Smolov Retrascope - 0.1 Actions
5836 Local Support Project Bug Resolved High не собирается проект на сервере Jenkins Sergey Smolov Sergey Smolov Actions
5861 Fortress Task Closed Low static boolean containsSingleObject(Collection<?> collection) Sergey Smolov Andrei Tatarnikov Fortress - 0.3 Actions
5868 Retrascope Task Closed Normal Migrate to Fortress 0.4 Sergey Smolov Sergey Smolov Retrascope - 0.1 Actions
5870 Retrascope Task Closed Normal Retrascope exceptions Sergey Smolov Igor Melnichenko Retrascope - 0.1 Actions
5871 Retrascope Bug Closed Normal ru.ispras.retrascope.test.printer.testbench -> ru.ispras.retrascope.engine.test.printer.testbench Sergey Smolov Igor Melnichenko Retrascope - 0.1 Actions
5872 Retrascope Task Closed Normal HDL file meta info Sergey Smolov Sergey Smolov Retrascope - 0.1 Actions
5873 Retrascope Bug Closed High missing transitions in b04 EFSM Sergey Smolov Sergey Smolov Retrascope - 0.1 Actions
5875 Retrascope Task Closed Normal Check state/transition count for extracted EFSM models Sergey Smolov Sergey Smolov Retrascope - 0.1 Actions
5881 Verilog Translator Task Closed Normal keep file names in the AST top nodes Sergey Smolov Sergey Smolov Verilog Translator - 0.1 Actions
5887 Retrascope Task Closed Normal rename 'decider_parser.vhd' Sergey Smolov Igor Melnichenko Retrascope - 0.1 Actions
5896 Retrascope Task Closed Normal remove parameterized collections from public method interfaces Sergey Smolov Sergey Smolov Retrascope - 0.1 Actions
5897 Retrascope Task Closed Normal fix javadoc for methods using InvariantChecks.checkNotNull Sergey Smolov Sergey Smolov Retrascope - 0.1 Actions
5904 Retrascope Task Closed Normal save jUnit test results in build/test-results Sergey Smolov Sergey Smolov Retrascope - 0.1 Actions
5907 Fortress Task Closed Normal boolean areOfType(DataTypeId id, Node ... nodes) Sergey Smolov Andrei Tatarnikov Fortress - 0.3 Actions
5966 MicroTESK Bug Closed Normal mark shell scripts as executable in the distribution tar.gz archive Sergey Smolov Sergey Smolov MicroTESK - 2.5 Actions
5967 MicroTESK Task Closed Low one directory for all components of distribution Sergey Smolov Andrei Tatarnikov MicroTESK - 2.2 Actions
5985 Fortress Task Closed High Node ExprUtils.getEquation(Node target, Node value) Sergey Smolov Andrei Tatarnikov Fortress - 0.4 Actions
5993 Fortress Task Closed Normal boolean ExprUtils.isKind(Node.Kind kind, Node ... nodes) Sergey Smolov Andrei Tatarnikov Fortress - 0.4 Actions
6041 Retrascope Task Closed Normal move to gradle based build system Sergey Smolov Sergey Smolov Retrascope - 0.1 Actions
6049 Retrascope Task Closed Normal VHDL test printer: write documentation to project wiki Sergey Smolov Igor Melnichenko Retrascope - 0.1 Actions
6050 Retrascope Task Closed High Path to testbench directory as command-line parameter Sergey Smolov Igor Melnichenko Retrascope - 0.1 Actions
6051 Retrascope Task Closed Normal state-like variable names option Sergey Smolov Sergey Smolov Retrascope - 0.1 Actions
6059 Retrascope Task Closed Normal Simple solver for "x && !x" constraints Sergey Smolov Sergey Smolov Retrascope - 0.1 Actions
6060 Retrascope Task Closed Normal Add plasma to project test suite Sergey Smolov Sergey Smolov Retrascope - 0.2 Actions
6061 Retrascope Task Closed Normal EFSM-based transition assertion generator Sergey Smolov Sergey Smolov Retrascope - 1.0 Actions
6106 MicroTESK Bug Closed Normal zero opcodes for instructions in Tarmac log Sergey Smolov Andrei Tatarnikov MicroTESK - 2.2 Actions
6108 MicroTESK Task Closed Normal create environment variable(s) for SMT solver(s) Sergey Smolov Andrei Tatarnikov MicroTESK - 2.2 Actions
6241 MicroTESK Bug Closed Normal Generated assembler files contain tab-only lines Sergey Smolov Andrei Tatarnikov MicroTESK - 2.2 Actions
6263 Retrascope Bug Closed High Crash when test generation engine elaborates EFSMs from alu.vhd: java.lang.IllegalArgumentException Sergey Smolov Sergey Smolov Retrascope - 0.2 Actions
6279 Retrascope Bug Closed Normal TestXmlPrinterTestCase: IllegalArgumentException: Output file name isn't specified Sergey Smolov Igor Melnichenko Retrascope - 0.1 Actions
6280 Retrascope Bug Closed Normal TestVhdlTestbenchPrinterVhdlTestCase: The exception has occurred while printing test pattern file Sergey Smolov Igor Melnichenko Retrascope - 0.1 Actions
6281 Retrascope Bug Closed Normal EfsmTestGeneratorVhdlTestCase: Efsm.UNINITIALISED_STATE isn't supported yet Sergey Smolov Sergey Smolov Retrascope - 0.1 Actions
6282 Retrascope Task Closed High finish AstSmvVisitor & CfgAstVisitor merge Sergey Smolov Mikhail Lebedev Retrascope - 0.1 Actions
6293 Retrascope Bug Closed Normal XmlTestParserTestCase: NoSuchMethodException Sergey Smolov Igor Melnichenko Retrascope - 0.1 Actions
6301 Retrascope Task Closed Normal unused code Sergey Smolov Sergey Smolov Retrascope - 1.0 Actions
6327 Retrascope Task Closed Normal log messages class Sergey Smolov Sergey Smolov Retrascope - 0.1 Actions
6331 Retrascope Task Closed Normal look into unused classes Sergey Smolov Sergey Smolov Actions
6335 Retrascope Bug Closed Normal fifo.v: non-constant number of extracted EFSMs' transitions Sergey Smolov Sergey Smolov Retrascope - 0.1 Actions
6336 Retrascope Task Closed Normal jUnit tests for EfsmConflictExtractor Sergey Smolov Mikhail Lebedev Retrascope - 0.1 Actions
6350 Retrascope Task Closed Normal EfsmConflictExtractor wiki documentation Sergey Smolov Mikhail Lebedev Retrascope - 0.1 Actions
6352 Fortress Bug Closed High Transformer.standardize returns 'false' on (AND (EQ a 00) (NOT(EQ a b 00))) Sergey Smolov Artem Kotsynyak Fortress - 0.4 Actions
6353 Retrascope Bug Closed Normal Case children of one Switch node can have equal NodeValue Sergey Smolov Sergey Smolov Retrascope - 0.1 Actions
6354 Retrascope Task Closed Normal Collapsing group node for Module Sergey Smolov Alexander Protsenko Retrascope - 0.1 Actions
6355 Verilog Translator Bug Closed High src/test/verilog/fifo/fifo_testbench.v: NullPointerException Sergey Smolov Alexander Kamkin Verilog Translator - 0.1 Actions
6362 Retrascope Bug Rejected Normal src/test/verilog/adder/adder4_testbench.v: wrong CFG model Sergey Smolov Mikhail Chupilko Retrascope - 0.1 Actions
6363 Verilog Translator Bug Closed High src/test/verilog/fifo0/mem_2p.v: AbstractMethodError Sergey Smolov Alexander Kamkin Verilog Translator - 0.1 Actions
6364 Fortress Task Rejected Low SolverResult: implement equals\hashcode methods Sergey Smolov Andrei Tatarnikov Fortress - 0.4 Actions
6365 Retrascope Bug Closed Normal src/test/vhdl/example/example.vhd: IllegalArgumentException Sergey Smolov Mikhail Lebedev Retrascope - 0.1 Actions
6366 Retrascope Bug Rejected Normal src/test/vhdl/example/test.vhd: Efsm.UNINITIALISED_STATE isn't supported yet Sergey Smolov Igor Melnichenko Retrascope - 0.2 Actions
6367 Retrascope Task Closed Urgent Fortress expressions printing in an SMV format Sergey Smolov Mikhail Lebedev Retrascope - 0.1 Actions
6375 Retrascope Bug Closed Normal missing javadoc Sergey Smolov Igor Melnichenko Retrascope - 0.1 Actions
6389 Retrascope Task Closed Normal Wiki documentation about testbench simulation Sergey Smolov Sergey Smolov Retrascope - 0.1 Actions
6393 Retrascope Task Rejected Normal migrate to EFSM model containing only concurrent assignments Sergey Smolov Igor Melnichenko Retrascope - 0.2 Actions
6394 Local Support Project Bug New Normal Проект HDL Retrascope: на 17-дюймовом мониторе не масштабируется таблица Задачи Sergey Smolov Alexey Demakov Actions
6410 Retrascope Task Closed Normal no-loop/no-recursion functions elaboration Sergey Smolov Sergey Smolov Retrascope - 0.1 Actions
6412 Retrascope Task Rejected Normal engine combining HLDD & assertion model Sergey Smolov Sergey Smolov Retrascope - 0.1 Actions
6413 Retrascope Bug Closed Normal b03.vhd: different EFSM extraction stats Sergey Smolov Sergey Smolov Retrascope - 0.1 Actions
6423 Fortress Task Rejected Low to_real, to_int, is_int operations Sergey Smolov Andrei Tatarnikov Fortress - 0.4 Actions
6424 Retrascope Bug Closed Normal b05.vhd: line 64: at token "d32_-10": syntax error Sergey Smolov Mikhail Lebedev Retrascope - 0.1 Actions
6425 Retrascope Bug Closed Normal b12.vhd: XmvExprPrinter.getConstant(XmvExprPrinter.java:330) -> NullPointerException Sergey Smolov Mikhail Lebedev Retrascope - 0.1 Actions
6426 Retrascope Bug Closed Normal example.vhd: HlddXmvVisitor.onProcessEnd(HlddXmvVisitor.java:381) -> NullPointerException Sergey Smolov Mikhail Lebedev Retrascope - 0.1 Actions
6430 Retrascope Bug Closed Normal b14.vhd: StackOverflowError Sergey Smolov Sergey Smolov Retrascope - 0.2 Actions
6431 Retrascope Task Closed Normal descriptor for (VHDL) variables & signals Sergey Smolov Sergey Smolov Retrascope - 0.1 Actions
6443 Retrascope Bug Closed Normal print error message when "--toplevel" value is wrong Sergey Smolov Sergey Smolov Retrascope - 0.1 Actions
6445 Retrascope Task Closed Normal compare nuXmv and NuSMV Sergey Smolov Mikhail Lebedev Retrascope - 0.1 Actions
6446 Retrascope Task New Normal Promela translator to CFG representation (no buffers) Sergey Smolov Mikhail Lebedev Retrascope - 2.0 Actions
6447 Retrascope Task Closed Normal SMV-based counterexamples parser Sergey Smolov Mikhail Lebedev Retrascope - 0.2 Actions
6448 Retrascope Task New Low mapping description language + IR + parser Sergey Smolov Sergey Smolov Retrascope - 2.0 Actions
6449 Retrascope Task New Low testbench generator taking test sequences and mappings as inputs Sergey Smolov Sergey Smolov Retrascope - 2.0 Actions
6453 Retrascope Task Closed Normal Statement class for grouping CFG nodes Sergey Smolov Sergey Smolov Retrascope - 0.1 Actions
6454 Retrascope Task Closed Normal group sequential switches with boolean conditions of "x == a" form Sergey Smolov Sergey Smolov Retrascope - 0.1 Actions
6456 Retrascope Task Closed High CFG model as hirerarchical list of statements Sergey Smolov Sergey Smolov Retrascope - 0.1 Actions
6472 Retrascope Task Closed Normal b13.vhd: too long elaboration time Sergey Smolov Mikhail Lebedev Retrascope - 1.0 Actions
6483 Retrascope Task Closed High keep related clock-like variables for top-level containers of EFSM assertions Sergey Smolov Sergey Smolov Retrascope - 0.1 Actions
(201-300/688) Per page: 25, 50, 100

Also available in: Atom CSV PDF