Project

General

Profile

Issues

Filters

Apply Clear

# Project Tracker Status Priority Subject Author Assignee Target version
1210 Veritool Task Closed Normal $applyAction() + $checkAction = too much Alexander Kamkin Alexander Kamkin Actions
3095 C++TESK Testing ToolKit Task Closed Normal 20-ый билд перед отпуском Alexander Kamkin Alexander Kamkin Actions
6218 MicroTESK Task Closed Normal Add a reference to DataManager to EngineContext Alexander Kamkin Andrei Tatarnikov MicroTESK - 2.2 Actions
8698 MicroTESK Task Closed Normal Adding makefiles to MicroTESK demos Alexander Kamkin Andrei Tatarnikov MicroTESK - 2.4 Actions
8670 MicroTESK Bug Rejected Normal Address 0xffffffffa0002380 is unallocated. Simulation is paused until it is allocated. Alexander Kamkin Andrei Tatarnikov MicroTESK - 2.4 Actions
5986 MicroTESK Task Closed High Addresses in ConcreteCall and TestSequence Alexander Kamkin Andrei Tatarnikov MicroTESK - 2.2 Actions
6150 MicroTESK Bug Closed Normal Address translation specification Alexander Kamkin Artem Kotsynyak MicroTESK - 2.3 Actions
4392 Verilog Translator Task Closed Normal Add return value for on<Node>(Begin|End) methods Alexander Kamkin Alexander Kamkin Verilog Translator - 0.1 Actions
4670 C++TESK Testing ToolKit Task Closed Normal All resolved issues shoud be closed Alexander Kamkin Alexander Kamkin Actions
5435 MicroTESK Task Closed Normal An architecture validator engine is required Alexander Kamkin Andrei Tatarnikov MicroTESK - 2.2 Actions
2765 Retrascope Task Closed Normal Annotating variables with clocks Alexander Kamkin Sergey Smolov Actions
5955 MicroTESK Task Closed Normal Architecture-dependent configuration Alexander Kamkin Alexander Kamkin MicroTESK - 2.2 Actions
5345 MicroTESK Task Closed Normal [arch] Notes to the existing architecture models and templates Alexander Kamkin Andrei Tatarnikov MicroTESK - 2.1 Actions
3541 Verilog Translator Bug Closed Normal AST_ASSIGNMENT_STATEMENT -> AST_ASSIGN_STATEMENT Alexander Kamkin Alexander Kamkin Actions
3474 Verilog Translator Task Closed Normal AST_ASSIGNMENT для параметров Alexander Kamkin Alexander Kamkin Actions
3483 Verilog Translator Task Closed Normal AST_BODY_GENERATE -> AST_GENERATE_BLOCK Alexander Kamkin Alexander Kamkin Actions
4110 Verilog Translator Bug New Normal AST_DECLARATION: adding delay for net declarations Alexander Kamkin Alexander Kamkin Verilog Translator - 0.1 Actions
3485 Verilog Translator Task Closed Normal AST_DISCRETE_ASSIGNMENT -> AST_ASSIGNMENT_STATEMENT Alexander Kamkin Alexander Kamkin Actions
3486 Verilog Translator Task Closed Normal AST_EVENT_TRIGGER -> AST_EVENT_TRIGGER_STATEMENT Alexander Kamkin Alexander Kamkin Actions
4111 Verilog Translator Task Closed Normal AST_INSTANTIATION: += AST_STRENGTH Alexander Kamkin Alexander Kamkin Actions
3542 Verilog Translator Task Closed Normal AST_MODULE -> AST_MODULE_TYPE, AST_*_DECLARATION -> AST_* Alexander Kamkin Alexander Kamkin Actions
3480 Verilog Translator Task Closed Normal AST_PORT_CONNECTION += AST_ATTRIBUTES Alexander Kamkin Alexander Kamkin Actions
3537 Verilog Translator Task Closed Normal AST_PROCESS -> AST_ACTIVITY Alexander Kamkin Alexander Kamkin Actions
3459 Verilog Translator Task Closed Normal AST_TYPE structure refactoring Alexander Kamkin Alexander Kamkin Actions
3538 Verilog Translator Bug Closed Normal AST_VARIABLE -> AST_ELEMENT Alexander Kamkin Actions
1777 C++TESK Testing ToolKit Task Closed Normal Attach the user documents to 'Documents' Alexander Kamkin Alexander Kamkin Actions
4808 MicroTESK Task Rejected Normal Automated extraction of initialization code Alexander Kamkin Alexander Kamkin Actions
5924 MicroTESK Task Closed Normal Automatic marks insertion for exceptions Alexander Kamkin Andrei Tatarnikov MicroTESK - 2.2 Actions
6086 MicroTESK Bug Closed Immediate Basic comments in newly created sources Alexander Kamkin Artem Kotsynyak MicroTESK - 2.2 Actions
7641 MicroTESK Task Closed Normal Basic support for multiple-PE testing Alexander Kamkin Andrei Tatarnikov MicroTESK - 2.4 Actions
4947 Retrascope Task Closed Normal [basis][engine] Описатель параметров командной строки Alexander Kamkin Alexander Kamkin Retrascope - 0.1 Actions
4923 Retrascope Task Closed Normal [basis][log] Подсистема логирования Alexander Kamkin Alexander Kamkin Retrascope - 0.1 Actions
5022 Retrascope Task Closed Normal [basis][testgen] Разработка конвертера тестовой последовательности в формат DECIDER Alexander Kamkin Igor Melnichenko Retrascope - 0.1 Actions
4878 Retrascope Task Closed Normal [basis][testgen] Разработка парсера внешнего представления тестовой последовательности Alexander Kamkin Igor Melnichenko Retrascope - 0.1 Actions
4876 Retrascope Task Closed Normal [basis][testgen] Разработка представления тестовой последовательности Alexander Kamkin Alexander Kamkin Retrascope - 0.1 Actions
4985 Retrascope Bug Closed Normal [basis] the 'test' target is unreachable Alexander Kamkin Alexander Kamkin Retrascope - 0.1 Actions
4906 Retrascope Task Closed High [basis] Интерфейсы базовых сущностей Retrascope Alexander Kamkin Alexander Kamkin Retrascope - 0.1 Actions
4995 Retrascope Bug Closed Normal [basis] Ошибочный порядок применения инструментов Alexander Kamkin Alexander Kamkin Retrascope - 0.1 Actions
5088 Retrascope Task Closed Normal [basis] Поддержка параметров командной строки с предопределенным набором значений Alexander Kamkin Alexander Kamkin Retrascope - 0.1 Actions
5952 MicroTESK Task Closed Normal Biased distribution over test situations Alexander Kamkin Andrei Tatarnikov MicroTESK - 2.3 Actions
8676 Fortress Bug Closed Normal BitVector's comparison operations return BitVector Alexander Kamkin Andrei Tatarnikov Fortress - 0.4 Actions
4066 Fortress Bug Closed Normal Bitwise XOR operaton is not supported Alexander Kamkin Alexander Kamkin Fortress - 0.1 Actions
4335 Verilog Translator Bug Closed Normal bootstrap class path not set in conjunction with source 1.6 Alexander Kamkin Alexander Kamkin Actions
6533 MicroTESK Bug Closed Normal Branch Engine: java.lang.IllegalStateException: Value is not set. Alexander Kamkin Andrei Tatarnikov MicroTESK - 2.3 Actions
6439 MicroTESK Task Closed Immediate Buffer preparator: entry(lo, hi) Alexander Kamkin Andrei Tatarnikov MicroTESK - 2.3 Actions
10061 MicroTESK Bug New Normal Buffers are now shared among all processing elements Alexander Kamkin Artem Kotsynyak MicroTESK - 2.5 Actions
9390 MicroTESK Bug Closed Normal Bug in code allocation Alexander Kamkin Alexander Kamkin MicroTESK - 2.4 Actions
5679 MicroTESK Bug Closed High Bug in test data generation Alexander Kamkin Andrei Tatarnikov MicroTESK - 2.2 Actions
6289 MicroTESK Bug Closed Normal Bug in the MMU solver Alexander Kamkin Alexander Kamkin MicroTESK - 2.3 Actions
4333 Fortress Task Closed Normal Build 0.2.2 with support of calculators Alexander Kamkin Alexander Kamkin Fortress - 0.2 Actions
2580 C++TESK Testing ToolKit Task Closed Normal Build 1.0.19 Alexander Kamkin Alexander Kamkin C++TESK Testing ToolKit - 1.0 Actions
1822 C++TESK Testing ToolKit Task Closed Normal Build 13 Alexander Kamkin Alexander Kamkin Actions
4131 MicroTESK Task Closed Normal [build] A target for generating javadoc documentation Alexander Kamkin Andrei Tatarnikov Actions
4132 MicroTESK Task Closed Normal [build] A target for launching junit tests Alexander Kamkin Alexander Kamkin Actions
4862 MicroTESK Bug Closed Immediate [build] ChangeLog has not be updated Alexander Kamkin Andrei Tatarnikov MicroTESK - 2.0 Actions
4130 MicroTESK Bug Closed Urgent [build] Compilation error Alexander Kamkin Taya Sergeeva Actions
4099 MicroTESK Bug Closed High [build] Compilation error Alexander Kamkin Andrei Tatarnikov Actions
5018 Retrascope Bug Closed Normal [build] Compilation warnings: unchecked call Alexander Kamkin Павел Шестаков Retrascope - 0.1 Actions
4774 MicroTESK Bug Closed Urgent [build] compile.sh (being executed in any directory except bin) fails Alexander Kamkin Andrei Tatarnikov MicroTESK - 2.0 Actions
6524 MicroTESK Bug Closed Normal Build failed: cannot download CVC4 Alexander Kamkin Andrei Tatarnikov MicroTESK - 2.3 Actions
5346 MicroTESK Bug Closed Normal [build] Files LICENSE and NOTICE should be added Alexander Kamkin Alexander Kamkin MicroTESK - 2.1 Actions
5035 Fortress Task Closed High [build] New build required Alexander Kamkin Andrei Tatarnikov Fortress - 0.3 Actions
4777 MicroTESK Task Closed Urgent [build] README file is missing Alexander Kamkin Andrei Tatarnikov MicroTESK - 2.0 Actions
4803 MicroTESK Bug Closed Normal [build] run 'ant -f setup.xml' to get latest BuildBase build script Alexander Kamkin Alexander Kamkin MicroTESK - 2.0 Actions
4776 MicroTESK Task Closed Urgent [build] Strange structure of the MicroTESK home directory Alexander Kamkin Andrei Tatarnikov MicroTESK - 2.0 Actions
4136 MicroTESK Bug Closed Normal [build] Test ru.ispras.microtesk.model.api.mmu.tests.LruTestCase FAILED Alexander Kamkin Taya Sergeeva Actions
5275 Retrascope Task Closed Normal [build] Добавить проект в Hudson Alexander Kamkin Sergey Smolov Retrascope - 0.1 Actions
5067 Retrascope Bug Closed Immediate [build] Не нужно комитить некомпилируемое! Alexander Kamkin Alexander Protsenko Retrascope - 0.1 Actions
3961 MicroTESK Task Closed Normal [build] Первый билд проекта Alexander Kamkin Andrei Tatarnikov Actions
3909 MicroTESK Bug Closed Normal [build] Проект не компилируется java 1.6 Alexander Kamkin Andrei Tatarnikov Actions
3823 MicroTESK Task Closed High [build] Скрипт запуска инструмента Alexander Kamkin Andrei Tatarnikov Actions
4893 Retrascope Task Closed Normal [build] Скрипт сборки проекта Alexander Kamkin Sergey Smolov Retrascope - 0.1 Actions
4121 C++TESK Testing ToolKit Task New Normal [build] Стабилизация версии 1.0 Alexander Kamkin Mikhail Chupilko C++TESK Testing ToolKit - 1.0 Actions
10193 MicroTESK Task New Normal Cache instances configuration Alexander Kamkin Artem Kotsynyak MicroTESK - 2.5 Actions
10181 MicroTESK Bug Resolved High CacheUnitTestCase causes StackOverflowError Alexander Kamkin Alexander Kamkin MicroTESK - 2.5 Actions
10188 MicroTESK Bug Resolved Normal CacheUnitTestCase fails for exclusive caches Alexander Kamkin Alexander Kamkin MicroTESK - 2.5 Actions
4992 Fortress Bug Closed Normal [calculator] В StandardOperationsInt операции MOD и REM реализованы одинаково Alexander Kamkin Andrei Tatarnikov Fortress - 0.3 Actions
4993 Fortress Bug Closed Normal [calculator] Для неассоциативных операций некорректно указывать BINARY_UNBOUND Alexander Kamkin Andrei Tatarnikov Fortress - 0.3 Actions
4987 Fortress Task Closed Normal [calculator] Переименование класса Range Alexander Kamkin Andrei Tatarnikov Fortress - 0.3 Actions
4989 Fortress Task Closed High [calculator] Поддержка операций произвольной арности Alexander Kamkin Andrei Tatarnikov Fortress - 0.3 Actions
6103 MicroTESK Task Closed Urgent Call.getTargetLabel method wanted Alexander Kamkin Andrei Tatarnikov MicroTESK - 2.2 Actions
6142 MicroTESK Task Closed Normal Call's method getBlockSize() Alexander Kamkin Andrei Tatarnikov MicroTESK - 2.2 Actions
6140 MicroTESK Task Closed Normal Call's methods isLoad() and isStore() Alexander Kamkin Andrei Tatarnikov MicroTESK - 2.2 Actions
8726 Verilog Translator Bug Closed Normal Cannot find the module declaration inside the module Alexander Kamkin Alexander Kamkin Verilog Translator - 0.1 Actions
4393 Verilog Translator Task Closed Normal CaseGenerateItem and Case Alexander Kamkin Alexander Kamkin Actions
2520 Aspectrace Bug Rejected Normal Caused by: java.lang.NumberFormatException: For input string: "<font color="#FF0000">?</font></b>" Alexander Kamkin Anastasia Tugaenko Actions
5268 Retrascope Task Closed Normal [cfg][backend][cfg] Объединение простейших процессов Alexander Kamkin Sergey Smolov Retrascope - 0.1 Actions
5115 Retrascope Task Rejected Normal [cfg] CfgProcessNode.getDescription: posedge/negedge Alexander Kamkin Павел Шестаков Retrascope - 0.1 Actions
4919 Retrascope Task Closed Normal [cfg][engine] Базовый инструмент для CfgModel Alexander Kamkin Alexander Kamkin Retrascope - 0.1 Actions
4916 Retrascope Task Closed Normal [cfg][model] Добавить класс верхнего уровня CfgModel Alexander Kamkin Sergey Smolov Retrascope - 0.1 Actions
5274 Retrascope Task Closed Normal [cfg][printer][graphml] Получение принтера выражений из конфигурации Alexander Kamkin Alexander Protsenko Retrascope - 0.1 Actions
5101 Retrascope Bug Closed High [cfg] The exception has been encountered: java.lang.IllegalStateException: Incorrect variable data type Alexander Kamkin Sergey Smolov Retrascope - 0.1 Actions
4959 Retrascope Task Closed Normal [cfg][transformer][efsm] Разработка fake-версии CfgEfsmTransformer Alexander Kamkin Igor Melnichenko Retrascope - 0.1 Actions
5026 Retrascope Task Closed Normal [cfg][transformer][efsm] Создание примеров EFSM-моделей Alexander Kamkin Mikhail Lebedev Retrascope - 0.1 Actions
5082 Retrascope IDE Bug Closed Normal [cfg][visualizator][zest] В графе не рисуются стрелки Alexander Kamkin Alexander Protsenko Actions
5083 Retrascope IDE Task Closed Normal [cfg][visualizator][zest] Используется неудачный метод размещения Alexander Kamkin Alexander Protsenko Actions
5084 Retrascope IDE Bug Closed Normal [cfg][visualizator][zest] Используются неправильные фигуры для узлов графа Alexander Kamkin Alexander Protsenko Actions
5085 Retrascope IDE Bug Closed Normal [cfg][visualizator][zest] Не отображается код в узлах графа Alexander Kamkin Alexander Kamkin Actions
5276 Retrascope IDE Task New Normal [cfg][visualizator][zest] Отладить размещение графа с циклами Alexander Kamkin Alexander Kamkin Retrascope IDE - 0.1 Actions
5261 Retrascope IDE Bug Closed Normal [cfg][visualizator][zest] Ошибки в узлах ветвления Alexander Kamkin Alexander Protsenko Actions
(1-100/732) Per page: 25, 50, 100

Also available in: Atom CSV PDF